Target
Plasmepsin IV, putative
Ligand
BDBM50299000
Substrate
Meas. Tech.
ChEMBL_588259 (CHEMBL1050916)
Ki
120±n/a nM
Citation
 Orrling, KMMarzahn, MRGutiérrez-de-Terán, HAqvist, JDunn, BMLarhed, M alpha-Substituted norstatines as the transition-state mimic in inhibitors of multiple digestive vacuole malaria aspartic proteases. Bioorg Med Chem 17:5933-49 (2009)  
Target
Name:
Plasmepsin IV, putative
Synonyms:
Aspartic protease PM4
Type:
PROTEIN
Mol. Mass.:
51656.81
Organism:
Plasmodium vivax
Description:
ChEMBL_588259
Residue:
450
  
Inhibitor
Name:
BDBM50299000
Synonyms:
(B)-(4R)-3-(2-Benzyl-3-(2-(2,6-dimethylphenoxy)acetamido)-2-hydroxypropanoyl)-N-((1S,2R)-2-hydroxy-1-indanyl)-5,5-dimethylthiazolidine-4-carboxamide | CHEMBL584192
Type:
Small organic molecule
Emp. Form.:
C35H41N3O6S
Mol. Mass.:
631.782
SMILES:
Cc1cccc(C)c1OCC(=O)NC[C@](O)(Cc1ccccc1)C(=O)N1CSC(C)(C)[C@@H]1C(=O)N[C@@H]1[C@H](O)Cc2ccccc12
: