Target
Tyrosine-protein phosphatase non-receptor type 1
Ligand
BDBM50299153
Substrate
Meas. Tech.
ChEMBL_592083 (CHEMBL1038652)
Ki
2100±n/a nM
Citation
 Bhattarai, BRKafle, BHwang, JSKhadka, DLee, SMKang, JSHam, SWHan, IOPark, HCho, H Thiazolidinedione derivatives as PTP1B inhibitors with antihyperglycemic and antiobesity effects. Bioorg Med Chem Lett 19:6161-5 (2009)  
Target
Name:
Tyrosine-protein phosphatase non-receptor type 1
Synonyms:
PTN1_HUMAN PTPN1 Protein tyrosine phosphatase-1B (PTP1B) Protein-tyrosine phosphatase 1B (PTP1B) Tyrosine-protein phosphatase non-receptor type 1 (PTP1B)
Type:
Protein phosphatase
Mol. Mass.:
49963.76
Organism:
Homo sapiens (Human)
Description:
Human recombinant GST-fusion PTP1B (1-435).
Residue:
435
  
Inhibitor
Name:
BDBM50299153
Synonyms:
(Z)-5-{2-[3,5-bis(trifluoromethyl)benzyloxy]-5-bromobenzylidene}thiazolidine-2,4-dione | CHEMBL574813
Type:
Small organic molecule
Emp. Form.:
C19H10BrF6NO3S
Mol. Mass.:
526.247
SMILES:
OC1=NC(=O)C(S1)=Cc1cc(Br)ccc1OCc1cc(cc(c1)C(F)(F)F)C(F)(F)F
: