Target
Cytochrome P450 2C19
Ligand
BDBM50299165
Substrate
Meas. Tech.
ChEMBL_592314 (CHEMBL1046689)
IC50
>10000±n/a nM
Citation
 Thoma, GBaenteli, RLewis, IWagner, TOberer, LBlum, WGlickman, FStreiff, MBZerwes, HG Special ergolines are highly selective, potent antagonists of the chemokine receptor CXCR3: discovery, characterization and preliminary SAR of a promising lead. Bioorg Med Chem Lett 19:6185-8 (2009)  
Target
Name:
Cytochrome P450 2C19
Synonyms:
CP2CJ_HUMAN CYPIIC17 Cytochrome P450 2C19 (CYP2C19) Mephenytoin 4-hydroxylase P450-254C
Type:
Enzyme
Mol. Mass.:
55935.47
Organism:
Homo sapiens (Human)
Description:
P33261
Residue:
490
  
Inhibitor
Name:
BDBM50299165
Synonyms:
(6aR,9R)-N9,N9-diethyl-N7-phenyl-6,6a,8,9-tetrahydroindolo[4,3-fg]quinoline-7,9(4H)-dicarboxamide | CHEMBL584554
Type:
Small organic molecule
Emp. Form.:
C26H28N4O2
Mol. Mass.:
428.5261
SMILES:
CCN(CC)C(=O)[C@H]1CN([C@@H]2Cc3c[nH]c4cccc(C2=C1)c34)C(=O)Nc1ccccc1
: