Target
C-X-C chemokine receptor type 3
Ligand
BDBM50299175
Substrate
Meas. Tech.
ChEMBL_592307 (CHEMBL1046682)
IC50
313±n/a nM
Citation
 Thoma, GBaenteli, RLewis, IWagner, TOberer, LBlum, WGlickman, FStreiff, MBZerwes, HG Special ergolines are highly selective, potent antagonists of the chemokine receptor CXCR3: discovery, characterization and preliminary SAR of a promising lead. Bioorg Med Chem Lett 19:6185-8 (2009)  
Target
Name:
C-X-C chemokine receptor type 3
Synonyms:
AAO92295.1 C-X-C chemokine receptor type 3 (CXCR3) CXCR3 CXCR3_HUMAN chemokine (C-X-C motif) receptor 3
Type:
Enzyme Catalytic Domain
Mol. Mass.:
40665.65
Organism:
Homo sapiens (Human)
Description:
Residue:
368
  
Inhibitor
Name:
BDBM50299175
Synonyms:
(6aR,9R)-N9,N9-diethyl-N7-p-tolyl-6,6a,8,9-tetrahydroindolo[4,3-fg]quinoline-7,9(4H)-dicarboxamide | CHEMBL574831
Type:
Small organic molecule
Emp. Form.:
C27H30N4O2
Mol. Mass.:
442.5527
SMILES:
CCN(CC)C(=O)[C@H]1CN([C@@H]2Cc3c[nH]c4cccc(C2=C1)c34)C(=O)Nc1ccc(C)cc1
: