Target
Cathepsin S
Ligand
BDBM50299196
Substrate
Meas. Tech.
ChEMBL_592355 (CHEMBL1048481)
IC50
230±n/a nM
Citation
 Ameriks, MKCai, HEdwards, JPGebauer, DGleason, EGu, YKarlsson, LNguyen, SSun, SThurmond, RLZhu, J Pyrazole-based arylalkyne cathepsin S inhibitors. Part II: optimization of cellular potency. Bioorg Med Chem Lett 19:6135-9 (2009)  
Target
Name:
Cathepsin S
Synonyms:
CATS_HUMAN Cathepsin S (Cat S) | cathepsin S preproprotein
Type:
Protein
Mol. Mass.:
37507.38
Organism:
Homo sapiens (Human)
Description:
P25774
Residue:
331
  
Inhibitor
Name:
BDBM50299196
Synonyms:
CHEMBL573657 | N-(4-((2-chloro-5-(5-(methylsulfonyl)-1-(3-morpholinopropyl)-4,5,6,7-tetrahydro-1H-pyrazolo[4,3-c]pyridin-3-yl)phenyl)ethynyl)benzyl)-1-(4-methoxyphenyl)methanamine
Type:
Small organic molecule
Emp. Form.:
C37H42ClN5O4S
Mol. Mass.:
688.278
SMILES:
COc1ccc(CNCc2ccc(cc2)C#Cc2cc(ccc2Cl)-c2nn(CCCN3CCOCC3)c3CCN(Cc23)S(C)(=O)=O)cc1
: