Target
Tyrosine-protein phosphatase non-receptor type 1
Ligand
BDBM14245
Substrate
Meas. Tech.
ChEMBL_590753 (CHEMBL1050895)
Ki
1300±n/a nM
Citation
 Vidovic, DSchürer, SC Knowledge-based characterization of similarity relationships in the human protein-tyrosine phosphatase family for rational inhibitor design. J Med Chem 52:6649-59 (2009)  
Target
Name:
Tyrosine-protein phosphatase non-receptor type 1
Synonyms:
PTN1_HUMAN PTPN1 Protein tyrosine phosphatase-1B (PTP1B) Protein-tyrosine phosphatase 1B (PTP1B) Tyrosine-protein phosphatase non-receptor type 1 (PTP1B)
Type:
Protein phosphatase
Mol. Mass.:
49963.76
Organism:
Homo sapiens (Human)
Description:
Human recombinant GST-fusion PTP1B (1-435).
Residue:
435
  
Inhibitor
Name:
BDBM14245
Synonyms:
4-bromo-3-(carboxymethoxy)-5-phenylthiophene-2-carboxylic acid Monocyclic thiophene analog 11
Type:
Small organic molecule
Emp. Form.:
C13H9BrO5S
Mol. Mass.:
357.177
SMILES:
OC(=O)COc1c(Br)c(sc1C(O)=O)-c1ccccc1
: