Target
Tyrosine-protein phosphatase non-receptor type 2
Ligand
BDBM14255
Substrate
Meas. Tech.
ChEMBL_590754 (CHEMBL1050896)
Ki
1600±n/a nM
Citation
 Vidovic, DSchürer, SC Knowledge-based characterization of similarity relationships in the human protein-tyrosine phosphatase family for rational inhibitor design. J Med Chem 52:6649-59 (2009)  
Target
Name:
Tyrosine-protein phosphatase non-receptor type 2
Synonyms:
PTN2_HUMAN PTPT T-cell protein-tyrosine phosphatase TCPTP Tyrosine-protein phosphatase non-receptor type 2 (TC-PTP)
Type:
Protein
Mol. Mass.:
48481.80
Organism:
Homo sapiens (Human)
Description:
P17706
Residue:
415
  
Inhibitor
Name:
BDBM14255
Synonyms:
4-bromo-3-(carboxymethoxy)-5-[4-(dimethylamino)phenyl]thiophene-2-carboxylic acid | Monocyclic thiophene analog 24
Type:
Small organic molecule
Emp. Form.:
C15H14BrNO5S
Mol. Mass.:
400.244
SMILES:
CN(C)c1ccc(cc1)-c1sc(C(O)=O)c(OCC(O)=O)c1Br
: