Target
Receptor-type tyrosine-protein phosphatase C
Ligand
BDBM14255
Substrate
Meas. Tech.
ChEMBL_590755 (CHEMBL1050897)
Ki
64000±n/a nM
Citation
 Vidovic, DSchürer, SC Knowledge-based characterization of similarity relationships in the human protein-tyrosine phosphatase family for rational inhibitor design. J Med Chem 52:6649-59 (2009)  
Target
Name:
Receptor-type tyrosine-protein phosphatase C
Synonyms:
CD45 L-CA PTPRC Receptor-type tyrosine-protein phosphatase C (CD45) | T200
Type:
Protein
Mol. Mass.:
147474.19
Organism:
Homo sapiens (Human)
Description:
P08575
Residue:
1306
  
Inhibitor
Name:
BDBM14255
Synonyms:
4-bromo-3-(carboxymethoxy)-5-[4-(dimethylamino)phenyl]thiophene-2-carboxylic acid | Monocyclic thiophene analog 24
Type:
Small organic molecule
Emp. Form.:
C15H14BrNO5S
Mol. Mass.:
400.244
SMILES:
CN(C)c1ccc(cc1)-c1sc(C(O)=O)c(OCC(O)=O)c1Br
: