Target
Receptor-type tyrosine-protein phosphatase F
Ligand
BDBM50299462
Substrate
Meas. Tech.
ChEMBL_590756 (CHEMBL1050898)
Ki
68000±n/a nM
Citation
 Vidovic, DSchürer, SC Knowledge-based characterization of similarity relationships in the human protein-tyrosine phosphatase family for rational inhibitor design. J Med Chem 52:6649-59 (2009)  
Target
Name:
Receptor-type tyrosine-protein phosphatase F
Synonyms:
LAR Leukocyte common antigen related (LAR) PTPRF_HUMAN Receptor-type tyrosine-protein phosphatase F (LAR)
Type:
Protein
Mol. Mass.:
212869.85
Organism:
Homo sapiens (Human)
Description:
P10586
Residue:
1907
  
Inhibitor
Name:
BDBM50299462
Synonyms:
2-(3-(dihydroxymethyl)naphthalen-2-ylamino)-2-oxoacetic acid | CHEMBL573989
Type:
Small organic molecule
Emp. Form.:
C13H11NO5
Mol. Mass.:
261.2301
SMILES:
OC(O)c1cc2ccccc2cc1NC(=O)C(O)=O
: