Target
Receptor-type tyrosine-protein phosphatase alpha
Ligand
BDBM50118751
Substrate
Meas. Tech.
ChEMBL_590760 (CHEMBL1037598)
Ki
180000±n/a nM
Citation
 Vidovic, DSchürer, SC Knowledge-based characterization of similarity relationships in the human protein-tyrosine phosphatase family for rational inhibitor design. J Med Chem 52:6649-59 (2009)  
Target
Name:
Receptor-type tyrosine-protein phosphatase alpha
Synonyms:
PTPA PTPRA_HUMAN Protein-tyrosine phosphatase alpha
Type:
Enzyme
Mol. Mass.:
90719.02
Organism:
Homo sapiens (Human)
Description:
P18433
Residue:
802
  
Inhibitor
Name:
BDBM50118751
Synonyms:
6-(Oxalyl-amino)-1H-indole-7-carboxylic acid CHEMBL341806
Type:
Small organic molecule
Emp. Form.:
C11H8N2O5
Mol. Mass.:
248.1916
SMILES:
OC(=O)C(=O)Nc1ccc2cc[nH]c2c1C(O)=O
: