Target
17-beta-hydroxysteroid dehydrogenase type 1
Ligand
BDBM25850
Substrate
Meas. Tech.
ChEMBL_592404 (CHEMBL1036977)
IC50
69±n/a nM
Citation
 Bey, EMarchais-Oberwinkler, SNegri, MKruchten, POster, AKlein, TSpadaro, AWerth, RFrotscher, MBirk, BHartmann, RW New insights into the SAR and binding modes of bis(hydroxyphenyl)thiophenes and -benzenes: influence of additional substituents on 17beta-hydroxysteroid dehydrogenase type 1 (17beta-HSD1) inhibitory activity and selectivity. J Med Chem 52:6724-43 (2009)  
Target
Name:
17-beta-hydroxysteroid dehydrogenase type 1
Synonyms:
17-beta-HSD 1 17-beta-hydroxysteroid dehydrogenase type 1 20-alpha-HSD E17KSR EDH17B1 EDHB17 Estradiol 17-beta-dehydrogenase 1 (17beta-HSD1) Placental 17-beta-hydroxysteroid dehydrogenase | SDR28C1
Type:
Enzyme
Mol. Mass.:
34945.13
Organism:
Homo sapiens (Human)
Description:
P14061
Residue:
328
  
Inhibitor
Name:
BDBM25850
Synonyms:
3-[5-(4-hydroxyphenyl)thiophen-2-yl]phenol | hydroxyphenyl substituted thiophene, 22
Type:
Small organic molecule
Emp. Form.:
C16H12O2S
Mol. Mass.:
268.33
SMILES:
Oc1ccc(cc1)-c1ccc(s1)-c1cccc(O)c1
: