Target
Non-lysosomal glucosylceramidase
Ligand
BDBM50299750
Substrate
Meas. Tech.
ChEMBL_589172 (CHEMBL1040323)
IC50
>1000000±n/a nM
Citation
 Risseeuw, MDvan den Berg, RJDonker-Koopman, WEvan der Marel, GAAerts, JMOverhand, MOverkleeft, HS Synthesis and evaluation of D-gluco-pyranocyclopropyl amines as potential glucosidase inhibitors. Bioorg Med Chem Lett 19:6600-3 (2009)  
Target
Name:
Non-lysosomal glucosylceramidase
Synonyms:
Beta-glucosidase GBA2_HUMAN SPG46
Type:
PROTEIN
Mol. Mass.:
104639.04
Organism:
Homo sapiens (Human)
Description:
ChEMBL_1435476
Residue:
927
  
Inhibitor
Name:
BDBM50299750
Synonyms:
(1S,3R,4S,5R,6R,7S)-4,5-Dihydroxy-3-(hydroxymethyl)-2-oxabicyclo[4.1.0]heptan-7-amine | CHEMBL574865
Type:
Small organic molecule
Emp. Form.:
C7H13NO4
Mol. Mass.:
175.1824
SMILES:
N[C@@H]1[C@H]2O[C@H](CO)[C@@H](O)[C@H](O)[C@@H]12
: