Target
Cellular tumor antigen p53
Ligand
BDBM50299820
Substrate
Meas. Tech.
ChEMBL_589609 (CHEMBL1052162)
IC50
6500±n/a nM
Citation
 Allen, JGBourbeau, MPWohlhieter, GEBartberger, MDMichelsen, KHungate, RGadwood, RCGaston, RDEvans, BMann, LWMatison, MESchneider, SHuang, XYu, DAndrews, PSReichelt, ALong, AMYakowec, PYang, EYLee, TAOliner, JD Discovery and optimization of chromenotriazolopyrimidines as potent inhibitors of the mouse double minute 2-tumor protein 53 protein-protein interaction. J Med Chem 52:7044-53 (2009)  
Target
Name:
Cellular tumor antigen p53
Synonyms:
Antigen NY-CO-13 GST-p53 P53 Phosphoprotein p53 Tumor Suppressor p53
Type:
fusion protein
Mol. Mass.:
43654.73
Organism:
Homo sapiens (Human)
Description:
The full-length His6-wt-p53 expressed in E. coli was used in assays.
Residue:
393
  
Inhibitor
Name:
BDBM50299820
Synonyms:
(+/-)-syn-6,7-Bis(4-bromophenyl)-1-ethoxy-12-methyl-7,12-dihydro-6H-chromeno[4,3-d][1,2,4]triazolo[1,5-a]pyrimidine | CHEMBL583626
Type:
Small organic molecule
Emp. Form.:
C27H22Br2N4O2
Mol. Mass.:
594.297
SMILES:
CCOc1cccc2OC(C3=C(N(C)c4ncnn4C3c3ccc(Br)cc3)c12)c1ccc(Br)cc1
: