Target
Histone deacetylase 1
Ligand
BDBM50300003
Substrate
Meas. Tech.
ChEMBL_593116 (CHEMBL1042274)
EC50
>50000±n/a nM
Citation
 Ontoria, JMAltamura, SDi Marco, AFerrigno, FLaufer, RMuraglia, EPalumbi, MCRowley, MScarpelli, RSchultz-Fademrecht, CSerafini, SSteinkühler, CJones, P Identification of novel, selective, and stable inhibitors of class II histone deacetylases. Validation studies of the inhibition of the enzymatic activity of HDAC4 by small molecules as a novel approach for cancer therapy. J Med Chem 52:6782-9 (2009)  
Target
Name:
Histone deacetylase 1
Synonyms:
Cereblon/Histone deacetylase 1 HDAC1 Histone deacetylase 1 (HDAC1) RPD3L1
Type:
Enzyme
Mol. Mass.:
55090.27
Organism:
Homo sapiens (Human)
Description:
Q13547
Residue:
482
  
Inhibitor
Name:
BDBM50300003
Synonyms:
3-[5-(Trifluoroacetyl)thiophen-2-yl]benzoic Acid | CHEMBL569193
Type:
Small organic molecule
Emp. Form.:
C13H7F3O3S
Mol. Mass.:
300.253
SMILES:
OC(=O)c1cccc(c1)-c1ccc(s1)C(=O)C(F)(F)F
: