Target
E3 ubiquitin-protein ligase Mdm2
Ligand
BDBM50300116
Substrate
Meas. Tech.
ChEMBL_593610 (CHEMBL1039715)
Ki
1.5±n/a nM
Citation
 Yu, SQin, DShangary, SChen, JWang, GDing, KMcEachern, DQiu, SNikolovska-Coleska, ZMiller, RKang, SYang, DWang, S Potent and orally active small-molecule inhibitors of the MDM2-p53 interaction. J Med Chem 52:7970-3 (2009)  
Target
Name:
E3 ubiquitin-protein ligase Mdm2
Synonyms:
Double minute 2 protein E3 ubiquitin-protein ligase Mdm2 (p53-binding protein Mdm2) Human Double Minute 2 (HDM2) MDM2-MDMX p53-Binding Protein MDM2 | p53-binding protein
Type:
Oncoprotein
Mol. Mass.:
55196.54
Organism:
Homo sapiens (Human)
Description:
Q00987
Residue:
491
  
Inhibitor
Name:
BDBM50300116
Synonyms:
(2'R,3S,4'S,5'R)-6-chloro-4'-(3-chloro-2-fluorophenyl)-N-(2-(4-methylpiperazin-1-yl)ethyl)-2'-neopentyl-2-oxospiro[indoline-3,3'-pyrrolidine]-5'-carboxamide | CHEMBL577393
Type:
Small organic molecule
Emp. Form.:
C30H38Cl2FN5O2
Mol. Mass.:
590.559
SMILES:
CN1CCN(CCNC(=O)[C@@H]2N[C@H](CC(C)(C)C)[C@@]3([C@H]2c2cccc(Cl)c2F)C(=O)Nc2cc(Cl)ccc32)CC1
: