Target
5-hydroxytryptamine receptor 1A
Ligand
BDBM50300170
Substrate
Meas. Tech.
ChEMBL_594165 (CHEMBL1038744)
Ki
14±n/a nM
Citation
 Frecentese, FFiorino, FPerissutti, ESeverino, BMagli, EEsposito, ADe Angelis, FMassarelli, PNencini, CViti, BSantagada, VCaliendo, G Efficient microwave combinatorial synthesis of novel indolic arylpiperazine derivatives as serotoninergic ligands. Eur J Med Chem 45:752-9 (2010)  
Target
Name:
5-hydroxytryptamine receptor 1A
Synonyms:
5-HT-1A 5-HT1A 5-hydroxytryptamine receptor 1A (5HT1A) 5ht1a Htr1a Serotonin 1a (5-HT1a) receptor/Adrenergic receptor alpha-1 | Serotonin receptor 1A
Type:
G Protein-Coupled Receptor (GPCR)
Mol. Mass.:
46445.29
Organism:
Rattus norvegicus (rat)
Description:
Binding assays were performed using rat hippocampal membranes.
Residue:
422
  
Inhibitor
Name:
BDBM50300170
Synonyms:
CHEMBL568284 | Ethyl 5-(3-(4-(4-chlorophenyl)piperazin-1-yl)propoxy)-1Hindole-2-carboxylate
Type:
Small organic molecule
Emp. Form.:
C24H28ClN3O3
Mol. Mass.:
441.95
SMILES:
CCOC(=O)c1cc2cc(OCCCN3CCN(CC3)c3ccc(Cl)cc3)ccc2[nH]1
: