Target
Mast/stem cell growth factor receptor Kit
Ligand
BDBM50300196
Substrate
Meas. Tech.
ChEMBL_592725 (CHEMBL1042396)
Ki
1.9E2±n/a nM
Citation
 Wang, TDuffy, JPWang, JHalas, SSalituro, FGPierce, ACZuccola, HJBlack, JRHogan, JKJepson, SShlyakter, DMahajan, SGu, YHoock, TWood, MFurey, BFFrantz, JDDauffenbach, LMGermann, UAFan, BNamchuk, MBennani, YLLedeboer, MW Janus kinase 2 inhibitors. Synthesis and characterization of a novel polycyclic azaindole. J Med Chem 52:7938-41 (2009)  
Target
Name:
Mast/stem cell growth factor receptor Kit
Synonyms:
CD117 antigen KIT Mast/stem cell growth factor receptor Kit (cKIT) Proto-oncogene tyrosine-protein kinase Kit Stem cell growth factor receptor Tyrosine-protein kinase Kit c-kit v-kit Hardy-Zuckerman 4 feline sarcoma viral oncogene homolog
Type:
Protein
Mol. Mass.:
109869.37
Organism:
Homo sapiens (Human)
Description:
P10721
Residue:
976
  
Inhibitor
Name:
BDBM50300196
Synonyms:
10-(4-hydroxyphenyl)-8,13,15-triazatetracyclo[9.6.1.0^{2,7}.0^{14,18}]octadeca-1(18),2(7),3,5,11,14,16-heptaen-9-one atropisomer 1 | atropisomer 2
Type:
Small organic molecule
Emp. Form.:
C21H15N3O2
Mol. Mass.:
341.3627
SMILES:
Oc1ccc(cc1)C1c2c[nH]c3nccc(-c4ccccc4NC1=O)c23
: