Target
Beta-secretase 1
Ligand
BDBM50300228
Substrate
Meas. Tech.
ChEMBL_592915 (CHEMBL1048418)
IC50
2600±n/a nM
Citation
 Zhu, ZSun, ZYYe, YVoigt, JStrickland, CSmith, EMCumming, JWang, LWong, JWang, YSWyss, DFChen, XKuvelkar, RKennedy, MEFavreau, LParker, EMcKittrick, BAStamford, ACzarniecki, MGreenlee, WHunter, JC Discovery of cyclic acylguanidines as highly potent and selective beta-site amyloid cleaving enzyme (BACE) inhibitors: Part I--inhibitor design and validation. J Med Chem 53:951-65 (2010)  
Target
Name:
Beta-secretase 1
Synonyms:
ASP2 Aspartyl protease 2 BACE1 Beta-secretase (BACE) Beta-secretase 1 (BACE 1) Beta-secretase 1 (BACE1) Beta-site amyloid precursor protein cleaving enzyme 1 Memapsin-2 beta-Secretase (BACE-1) | beta-Secretase (BACE1)
Type:
Protein
Mol. Mass.:
55755.10
Organism:
Homo sapiens (Human)
Description:
P56817
Residue:
501
  
Inhibitor
Name:
BDBM50300228
Synonyms:
(2E,5R)-5-(2-cyclohexylethyl)-5-(cyclohexylmethyl)-2-imino-3-methylimidazolidin-4-one CHEMBL583178
Type:
Small organic molecule
Emp. Form.:
C19H33N3O
Mol. Mass.:
319.4848
SMILES:
CN1C(N)=N[C@](CCC2CCCCC2)(CC2CCCCC2)C1=O
: