Target
Beta-secretase 1
Ligand
BDBM114543
Substrate
Meas. Tech.
ChEMBL_592921 (CHEMBL1048424)
Kd
15000±n/a nM
Citation
 Wang, YSStrickland, CVoigt, JHKennedy, MEBeyer, BMSenior, MMSmith, EMNechuta, TLMadison, VSCzarniecki, MMcKittrick, BAStamford, AWParker, EMHunter, JCGreenlee, WJWyss, DF Application of fragment-based NMR screening, X-ray crystallography, structure-based design, and focused chemical library design to identify novel microM leads for the development of nM BACE-1 (beta-site APP cleaving enzyme 1) inhibitors. J Med Chem 53:942-50 (2010)  
Target
Name:
Beta-secretase 1
Synonyms:
ASP2 Aspartyl protease 2 BACE1 Beta-secretase (BACE) Beta-secretase 1 (BACE 1) Beta-secretase 1 (BACE1) Beta-site amyloid precursor protein cleaving enzyme 1 Memapsin-2 beta-Secretase (BACE-1) | beta-Secretase (BACE1)
Type:
Protein
Mol. Mass.:
55755.10
Organism:
Homo sapiens (Human)
Description:
P56817
Residue:
501
  
Inhibitor
Name:
BDBM114543
Synonyms:
(4-butoxy-3-chloranyl-phenyl)methyl carbamimidothioate;hydrochloride 2-(4-Butoxy-3-chloro-benzyl)-isothiourea CHEMBL568966 SMR000427725 cid_16681813
Type:
Small organic molecule
Emp. Form.:
C12H17ClN2OS
Mol. Mass.:
272.794
SMILES:
CCCCOc1ccc(CSC(N)=N)cc1Cl
: