Target
Tyrosine-protein kinase ZAP-70
Ligand
BDBM50300382
Substrate
Meas. Tech.
ChEMBL_591751 (CHEMBL1037893)
IC50
10±n/a nM
Citation
 Sanam, RVadivelan, STajne, SNarasu, LRambabu, GJagarlapudi, SA Discovery of potential ZAP-70 kinase inhibitors: pharmacophore design, database screening and docking studies. Eur J Med Chem 44:4793-800 (2009)  
Target
Name:
Tyrosine-protein kinase ZAP-70
Synonyms:
70 kDa zeta-associated protein Syk-related tyrosine kinase Tyrosine-protein kinase ZAP-70 Tyrosine-protein kinase ZAP-70 (ZAP70) ZAP70 Zeta-chain (TCR) associated protein kinase 70kDa
Type:
Enzyme
Mol. Mass.:
69881.61
Organism:
Homo sapiens (Human)
Description:
ZAP-70 SH2 domain was expressed and purified from E. coli using O-phospho-L-tyrosine-agarose column.
Residue:
619
  
Inhibitor
Name:
BDBM50300382
Synonyms:
4-(4-(5-chloro-4-(2-(propylsulfonyl)phenylamino)pyrimidin-2-ylamino)-3-methoxyphenyl)-N-methylpiperazine-1-carboxamide | CHEMBL573483
Type:
Small organic molecule
Emp. Form.:
C26H32ClN7O4S
Mol. Mass.:
574.095
SMILES:
CCCS(=O)(=O)c1ccccc1Nc1nc(Nc2ccc(cc2OC)N2CCN(CC2)C(=O)NC)ncc1Cl
: