Target
Sodium-dependent noradrenaline transporter
Ligand
BDBM50300514
Substrate
Meas. Tech.
ChEMBL_592526 (CHEMBL1044082)
IC50
20±n/a nM
Citation
 Mahaney, PEKim, CYCoghlan, RDCohn, STHeffernan, GDHuselton, CATerefenko, EAVu, ATZhang, PBurroughs, KDCosmi, SABray, JAJohnston, GHDeecher, DCTrybulski, EJ Structure-activity relationships of the 1-amino-3-(1H-indol-1-yl)-3-phenylpropan-2-ol series of monoamine reuptake inhibitors. Bioorg Med Chem Lett 19:5807-10 (2009)  
Target
Name:
Sodium-dependent noradrenaline transporter
Synonyms:
Monoamine transporter NET Noradrenaline Transporter (NET) Norepinephrine transporter protein (NET) SLC6A2 Sodium-dependent noradrenaline transporter (NET) | Solute carrier family 6 member 2
Type:
Multi-pass membrane protein
Mol. Mass.:
69337.72
Organism:
Homo sapiens (Human)
Description:
P23975
Residue:
617
  
Inhibitor
Name:
BDBM50300514
Synonyms:
(1S,2R)-1-(6-fluoro-1H-indol-1-yl)-1-(3-fluorophenyl)-3-(methylamino)propan-2-ol | CHEMBL575546
Type:
Small organic molecule
Emp. Form.:
C18H18F2N2O
Mol. Mass.:
316.3451
SMILES:
CNC[C@@H](O)[C@H](c1cccc(F)c1)n1ccc2ccc(F)cc12
: