Target
5-hydroxytryptamine receptor 6
Ligand
BDBM34156
Substrate
Meas. Tech.
ChEMBL_589212 (CHEMBL1041206)
Ki
3±n/a nM
Citation
 Mesquida, NLópez-Pérez, SDinarès, IFrigola, JMercè, RHolenz, JPérez, RBurgueño, JAlcalde, E Identification of novel indanylsulfonamide guanylhydrazones as potent 5-HT6 serotonin receptor antagonists. J Med Chem 52:6153-7 (2009)  
Target
Name:
5-hydroxytryptamine receptor 6
Synonyms:
5-HT-6 5-hydroxytryptamine receptor 6 (5-HT-6) 5-hydroxytryptamine receptor 6 (5HT6) HTR6 Serotonin 6 (5-HT6) receptor | Serotonin Receptor 6
Type:
G Protein-Coupled Receptor (GPCR)
Mol. Mass.:
46968.43
Organism:
Homo sapiens (Human)
Description:
P50406
Residue:
440
  
Inhibitor
Name:
BDBM34156
Synonyms:
indenylsulfonamide, 28
Type:
Small organic molecule
Emp. Form.:
C19H19ClN4O2S2
Mol. Mass.:
434.963
SMILES:
CN1CCC(C1)C1=CCc2ccc(NS(=O)(=O)c3c(Cl)nc4sccn34)cc12
: