Target
Cysteine protease
Ligand
BDBM50268557
Substrate
Meas. Tech.
ChEMBL_591545 (CHEMBL1062951)
IC50
240±n/a nM
Citation
 Mallari, JPShelat, AAKosinski, ACaffrey, CRConnelly, MZhu, FMcKerrow, JHGuy, RK Structure-guided development of selective TbcatB inhibitors. J Med Chem 52:6489-93 (2009)  
Target
Name:
Cysteine protease
Synonyms:
Rhodesain
Type:
PROTEIN
Mol. Mass.:
48425.78
Organism:
Trypanosoma brucei rhodesiense
Description:
ChEMBL_619861
Residue:
450
  
Inhibitor
Name:
BDBM50268557
Synonyms:
9-(3-hydroxypropyl)-6-(3-(thiophen-3-yl)benzylamino)-9H-purine-2-carbonitrile | CHEMBL497237
Type:
Small organic molecule
Emp. Form.:
C20H18N6OS
Mol. Mass.:
390.462
SMILES:
OCCCn1cnc2c(NCc3cccc(c3)-c3ccsc3)nc(nc12)C#N
: