Target
Cathepsin B
Ligand
BDBM50258404
Substrate
Meas. Tech.
ChEMBL_591547 (CHEMBL1062953)
IC50
>50000±n/a nM
Citation
 Mallari, JPShelat, AAKosinski, ACaffrey, CRConnelly, MZhu, FMcKerrow, JHGuy, RK Structure-guided development of selective TbcatB inhibitors. J Med Chem 52:6489-93 (2009)  
Target
Name:
Cathepsin B
Synonyms:
APP secretase CATB_HUMAN CTSB Cathepsin B light chain | Cathepsin B1
Type:
Enzyme
Mol. Mass.:
37819.69
Organism:
Homo sapiens (Human)
Description:
gi_63102437
Residue:
339
  
Inhibitor
Name:
BDBM50258404
Synonyms:
6-((3',5'-dichlorobiphenyl-3-yl)methylamino)-9-(3-hydroxypropyl)-9H-purine-2-carbonitrile | CHEMBL495016
Type:
Small organic molecule
Emp. Form.:
C22H18Cl2N6O
Mol. Mass.:
453.324
SMILES:
OCCCn1cnc2c(NCc3cccc(c3)-c3cc(Cl)cc(Cl)c3)nc(nc12)C#N
: