Target
Procathepsin L
Ligand
BDBM50268554
Substrate
Meas. Tech.
ChEMBL_591546 (CHEMBL1062952)
IC50
840±n/a nM
Citation
 Mallari, JPShelat, AAKosinski, ACaffrey, CRConnelly, MZhu, FMcKerrow, JHGuy, RK Structure-guided development of selective TbcatB inhibitors. J Med Chem 52:6489-93 (2009)  
Target
Name:
Procathepsin L
Synonyms:
CATL1_HUMAN CTSL CTSL1 Cathepsin L Cathepsin L1 heavy chain MEP cathepsin L preproprotein
Type:
Enzyme
Mol. Mass.:
37557.19
Organism:
Homo sapiens (Human)
Description:
Purchased from Calbiochem (San Diego, CA).
Residue:
333
  
Inhibitor
Name:
BDBM50268554
Synonyms:
6-(3-(furan-2-yl)benzylamino)-9-(3-hydroxypropyl)-9H-purine-2-carbonitrile | CHEMBL497235
Type:
Small organic molecule
Emp. Form.:
C20H18N6O2
Mol. Mass.:
374.3959
SMILES:
OCCCn1cnc2c(NCc3cccc(c3)-c3ccco3)nc(nc12)C#N
: