Target
Procathepsin L
Ligand
BDBM50300779
Substrate
Meas. Tech.
ChEMBL_591546 (CHEMBL1062952)
IC50
900±n/a nM
Citation
 Mallari, JPShelat, AAKosinski, ACaffrey, CRConnelly, MZhu, FMcKerrow, JHGuy, RK Structure-guided development of selective TbcatB inhibitors. J Med Chem 52:6489-93 (2009)  
Target
Name:
Procathepsin L
Synonyms:
CATL1_HUMAN CTSL CTSL1 Cathepsin L Cathepsin L1 heavy chain MEP cathepsin L preproprotein
Type:
Enzyme
Mol. Mass.:
37557.19
Organism:
Homo sapiens (Human)
Description:
Purchased from Calbiochem (San Diego, CA).
Residue:
333
  
Inhibitor
Name:
BDBM50300779
Synonyms:
9-(3-hydroxypropyl)-6-((2'-isopropylbiphenyl-3-yl)methylamino)-9H-purine-2-carbonitrile | CHEMBL569883
Type:
Small organic molecule
Emp. Form.:
C25H26N6O
Mol. Mass.:
426.5135
SMILES:
CC(C)c1ccccc1-c1cccc(CNc2nc(nc3n(CCCO)cnc23)C#N)c1
: