Target
Procathepsin L
Ligand
BDBM50268670
Substrate
Meas. Tech.
ChEMBL_591546 (CHEMBL1062952)
IC50
1100±n/a nM
Citation
 Mallari, JPShelat, AAKosinski, ACaffrey, CRConnelly, MZhu, FMcKerrow, JHGuy, RK Structure-guided development of selective TbcatB inhibitors. J Med Chem 52:6489-93 (2009)  
Target
Name:
Procathepsin L
Synonyms:
CATL1_HUMAN CTSL CTSL1 Cathepsin L Cathepsin L1 heavy chain MEP cathepsin L preproprotein
Type:
Enzyme
Mol. Mass.:
37557.19
Organism:
Homo sapiens (Human)
Description:
Purchased from Calbiochem (San Diego, CA).
Residue:
333
  
Inhibitor
Name:
BDBM50268670
Synonyms:
9-(3-hydroxypropyl)-6-((2'-methylbiphenyl-3-yl)methylamino)-9H-purine-2-carbonitrile | CHEMBL521904
Type:
Small organic molecule
Emp. Form.:
C23H22N6O
Mol. Mass.:
398.4604
SMILES:
Cc1ccccc1-c1cccc(CNc2nc(nc3n(CCCO)cnc23)C#N)c1
: