Target
Procathepsin L
Ligand
BDBM50300776
Substrate
Meas. Tech.
ChEMBL_591546 (CHEMBL1062952)
IC50
6000±n/a nM
Citation
 Mallari, JPShelat, AAKosinski, ACaffrey, CRConnelly, MZhu, FMcKerrow, JHGuy, RK Structure-guided development of selective TbcatB inhibitors. J Med Chem 52:6489-93 (2009)  
Target
Name:
Procathepsin L
Synonyms:
CATL1_HUMAN CTSL CTSL1 Cathepsin L Cathepsin L1 heavy chain MEP cathepsin L preproprotein
Type:
Enzyme
Mol. Mass.:
37557.19
Organism:
Homo sapiens (Human)
Description:
Purchased from Calbiochem (San Diego, CA).
Residue:
333
  
Inhibitor
Name:
BDBM50300776
Synonyms:
6-(3-(2,4-dimethoxypyrimidin-5-yl)benzylamino)-9-(3-hydroxypropyl)-9H-purine-2-carbonitrile | CHEMBL571269
Type:
Small organic molecule
Emp. Form.:
C22H22N8O3
Mol. Mass.:
446.4619
SMILES:
COc1ncc(-c2cccc(CNc3nc(nc4n(CCCO)cnc34)C#N)c2)c(OC)n1
: