Target
Solute carrier family 2, facilitated glucose transporter member 2
Ligand
BDBM50300883
Substrate
Meas. Tech.
ChEMBL_599700 (CHEMBL1045566)
Ki
6210000±n/a nM
Citation
 Trayner, BJGrant, TNWest, FGCheeseman, CI Synthesis and characterization of 6-deoxy-6-fluoro-D-fructose as a potential compound for imaging breast cancer with PET. Bioorg Med Chem 17:5488-95 (2009)  
Target
Name:
Solute carrier family 2, facilitated glucose transporter member 2
Synonyms:
GLUT2 SLC2A2
Type:
PROTEIN
Mol. Mass.:
57494.38
Organism:
Homo sapiens (Human)
Description:
ChEMBL_599700
Residue:
524
  
Inhibitor
Name:
BDBM50300883
Synonyms:
6-Deoxy-6-fluoro-D-fructose | CHEMBL568641
Type:
Small organic molecule
Emp. Form.:
C6H11FO5
Mol. Mass.:
182.1469
SMILES:
OCC1(O)O[C@H](CF)[C@@H](O)[C@@H]1O
: