Target
Rod cGMP-specific 3',5'-cyclic phosphodiesterase subunit alpha
Ligand
BDBM50300976
Substrate
Meas. Tech.
ChEMBL_597960 (CHEMBL1042745)
IC50
15±n/a nM
Citation
 Hughes, ROWalker, JKRogier, DJHeasley, SEBlevis-Bal, RMBenson, AGJacobsen, EJCubbage, JWFobian, YMOwen, DRFreskos, JNMolyneaux, JMBrown, DLAcker, BAMaddux, TMTollefson, MBMoon, JBMischke, BVRumsey, JMZheng, YMacInnes, ABond, BRYu, Y Optimization of the aminopyridopyrazinones class of PDE5 inhibitors: discovery of 3-[(trans-4-hydroxycyclohexyl)amino]-7-(6-methoxypyridin-3-yl)-1-(2-propoxyethyl)pyrido[3,4-b]pyrazin-2(1H)-one. Bioorg Med Chem Lett 19:5209-13 (2009)  
Target
Name:
Rod cGMP-specific 3',5'-cyclic phosphodiesterase subunit alpha
Synonyms:
PDE6A PDEA | Rod cGMP-specific 3',5'-cyclic phosphodiesterase alpha
Type:
PROTEIN
Mol. Mass.:
99531.10
Organism:
Homo sapiens (Human)
Description:
ChEMBL_1347866
Residue:
860
  
Inhibitor
Name:
BDBM50300976
Synonyms:
2-(7-(6-methoxypyridin-3-yl)-2-oxo-1-(2-propoxyethyl)-1,2-dihydropyrido[3,4-b]pyrazin-3-ylamino)-N-methylacetamide | CHEMBL568839
Type:
Small organic molecule
Emp. Form.:
C21H26N6O4
Mol. Mass.:
426.4689
SMILES:
CCCOCCn1c2cc(ncc2nc(NCC(=O)NC)c1=O)-c1ccc(OC)nc1
: