Target
Cannabinoid receptor 1
Ligand
BDBM50301030
Substrate
Meas. Tech.
ChEMBL_598162 (CHEMBL1044346)
EC50
0.9±n/a nM
Citation
 Du, WJewell, JPLin, LSColandrea, VJXiao, JCLao, JShen, CPBateman, TJReddy, VBHa, SNShah, SKFong, TMHale, JJHagmann, WK Synthesis and evaluation of N-[(1S,2S)-3-(4-chlorophenyl)-2-(3-cyanophenyl)-1-methylpropyl]-2-methyl-2-aminopropanamide as human cannabinoid-1 receptor (CB1R) inverse agonists. Bioorg Med Chem Lett 19:5195-9 (2009)  
Target
Name:
Cannabinoid receptor 1
Synonyms:
CANN6 CB-R CNR CNR1_HUMAN Cannabinoid receptor Cannabinoid receptor 1 (brain)
Type:
G Protein-Coupled Receptor (GPCR)
Mol. Mass.:
52868.96
Organism:
Homo sapiens (Human)
Description:
P21554
Residue:
472
  
Inhibitor
Name:
BDBM50301030
Synonyms:
CHEMBL567679 | N-((2S,3S)-4-(4-chlorophenyl)-3-(3-cyanophenyl)butan-2-yl)-2-methyl-2-(4-(trifluoromethyl)pyridin-2-ylamino)propanamide
Type:
Small organic molecule
Emp. Form.:
C27H26ClF3N4O
Mol. Mass.:
514.97
SMILES:
C[C@H](NC(=O)C(C)(C)Nc1cc(ccn1)C(F)(F)F)[C@@H](Cc1ccc(Cl)cc1)c1cccc(c1)C#N
: