Target
Histone-arginine methyltransferase CARM1
Ligand
BDBM50301070
Substrate
Meas. Tech.
ChEMBL_598368 (CHEMBL1037272)
IC50
17±n/a nM
Citation
 Wan, HHuynh, TPang, SGeng, JVaccaro, WPoss, MATrainor, GLLorenzi, MVGottardis, MJayaraman, LPurandare, AV Benzo[d]imidazole inhibitors of Coactivator Associated Arginine Methyltransferase 1 (CARM1)--Hit to Lead studies. Bioorg Med Chem Lett 19:5063-6 (2009)  
Target
Name:
Histone-arginine methyltransferase CARM1
Synonyms:
CARM1 Coactivator-associated arginine methyltransferase 1 PRMT4 Protein arginine methyltransferase 4 (PRMT4)
Type:
Protein
Mol. Mass.:
65855.47
Organism:
Homo sapiens (Human)
Description:
Q86X55
Residue:
608
  
Inhibitor
Name:
BDBM50301070
Synonyms:
2-(2-methoxypyridin-3-yl)-4-methyl-6-(piperidin-4-yl)-1H-benzo[d]imidazole | CHEMBL577498
Type:
Small organic molecule
Emp. Form.:
C19H22N4O
Mol. Mass.:
322.4042
SMILES:
COc1ncccc1-c1nc2c(C)cc(cc2[nH]1)C1CCNCC1
: