Target
Histamine H1 receptor
Ligand
BDBM50301095
Substrate
Meas. Tech.
ChEMBL_598547 (CHEMBL1043539)
IC50
>5000±n/a nM
Citation
 Ando, MSekino, EHaga, YMoriya, MIto, MIto, JIwaasa, HIshihara, AKanatani, AOhtake, N Discovery of novel phenethylpyridone derivatives as potent melanin-concentrating hormone 1 receptor antagonists. Bioorg Med Chem Lett 19:5186-90 (2009)  
Target
Name:
Histamine H1 receptor
Synonyms:
H1R HISTAMINE H1 HRH1_HUMAN
Type:
G Protein-Coupled Receptor (GPCR)
Mol. Mass.:
55808.72
Organism:
Homo sapiens (Human)
Description:
Cell pellets from SK-N-MC cells transfected with human H1 receptor were used in binding assay.
Residue:
487
  
Inhibitor
Name:
BDBM50301095
Synonyms:
4-(4-fluorobenzyloxy)-1-(4-((propylamino)methyl)phenethyl)pyridin-2(1H)-one | CHEMBL570296
Type:
Small organic molecule
Emp. Form.:
C24H27FN2O2
Mol. Mass.:
394.4818
SMILES:
CCCNCc1ccc(CCn2ccc(OCc3ccc(F)cc3)cc2=O)cc1
: