Target
Histamine H4 receptor
Ligand
BDBM50301095
Substrate
Meas. Tech.
ChEMBL_598550 (CHEMBL1043542)
IC50
>5000±n/a nM
Citation
 Ando, MSekino, EHaga, YMoriya, MIto, MIto, JIwaasa, HIshihara, AKanatani, AOhtake, N Discovery of novel phenethylpyridone derivatives as potent melanin-concentrating hormone 1 receptor antagonists. Bioorg Med Chem Lett 19:5186-90 (2009)  
Target
Name:
Histamine H4 receptor
Synonyms:
AXOR35 GPCR105 HH4R HRH4 Histamine H4 receptor Histamine receptor (H3 and H4) SP9144
Type:
G Protein-Coupled Receptor (GPCR)
Mol. Mass.:
44517.02
Organism:
Homo sapiens (Human)
Description:
Binding assays were using CHO cells stably expressing hH4R receptors.
Residue:
390
  
Inhibitor
Name:
BDBM50301095
Synonyms:
4-(4-fluorobenzyloxy)-1-(4-((propylamino)methyl)phenethyl)pyridin-2(1H)-one | CHEMBL570296
Type:
Small organic molecule
Emp. Form.:
C24H27FN2O2
Mol. Mass.:
394.4818
SMILES:
CCCNCc1ccc(CCn2ccc(OCc3ccc(F)cc3)cc2=O)cc1
: