Target
Kappa-type opioid receptor
Ligand
BDBM50301098
Substrate
Meas. Tech.
ChEMBL_598545 (CHEMBL1043537)
IC50
>5000±n/a nM
Citation
 Ando, MSekino, EHaga, YMoriya, MIto, MIto, JIwaasa, HIshihara, AKanatani, AOhtake, N Discovery of novel phenethylpyridone derivatives as potent melanin-concentrating hormone 1 receptor antagonists. Bioorg Med Chem Lett 19:5186-90 (2009)  
Target
Name:
Kappa-type opioid receptor
Synonyms:
K-OR-1 Kappa-opioid receptor (KOR) Kappa-type opioid receptor (KOR) OPIATE Kappa OPRK1 kappa opioid receptor (KOR)
Type:
G Protein-Coupled Receptor (GPCR)
Mol. Mass.:
42648.76
Organism:
Homo sapiens (Human)
Description:
P41145
Residue:
380
  
Inhibitor
Name:
BDBM50301098
Synonyms:
4-(4-fluorobenzyloxy)-1-(2-(5-((propylamino)methyl)pyridin-2-yl)ethyl)pyridin-2(1H)-one | CHEMBL565833
Type:
Small organic molecule
Emp. Form.:
C23H26FN3O2
Mol. Mass.:
395.4698
SMILES:
CCCNCc1ccc(CCn2ccc(OCc3ccc(F)cc3)cc2=O)nc1
: