Target
TGF-beta receptor type-1
Ligand
BDBM50148658
Substrate
Meas. Tech.
ChEMBL_598612 (CHEMBL1048115)
IC50
646±n/a nM
Citation
 Ren, JXLi, LLZou, JYang, LYang, JLYang, SY Pharmacophore modeling and virtual screening for the discovery of new transforming growth factor-beta type I receptor (ALK5) inhibitors. Eur J Med Chem 44:4259-65 (2009)  
Target
Name:
TGF-beta receptor type-1
Synonyms:
ALK-5 Activin A receptor type II-like protein kinase of 53kD SKR4 TGF-beta receptor type I TGFBR1 TGFR1_HUMAN Transforming growth factor-beta receptor type I
Type:
enzyme
Mol. Mass.:
55968.24
Organism:
Homo sapiens (Human)
Description:
P36897
Residue:
503
  
Inhibitor
Name:
BDBM50148658
Synonyms:
3-(4-Methoxy-phenyl)-2-pyridin-2-yl-5,6-dihydro-4H-pyrrolo[1,2-b]pyrazole CHEMBL120907
Type:
Small organic molecule
Emp. Form.:
C18H17N3O
Mol. Mass.:
291.3471
SMILES:
COc1ccc(cc1)-c1c2CCCn2nc1-c1ccccn1
: