Target
TGF-beta receptor type-1
Ligand
BDBM50148665
Substrate
Meas. Tech.
ChEMBL_598612 (CHEMBL1048115)
IC50
1300±n/a nM
Citation
 Ren, JXLi, LLZou, JYang, LYang, JLYang, SY Pharmacophore modeling and virtual screening for the discovery of new transforming growth factor-beta type I receptor (ALK5) inhibitors. Eur J Med Chem 44:4259-65 (2009)  
Target
Name:
TGF-beta receptor type-1
Synonyms:
ALK-5 Activin A receptor type II-like protein kinase of 53kD SKR4 TGF-beta receptor type I TGFBR1 TGFR1_HUMAN Transforming growth factor-beta receptor type I
Type:
enzyme
Mol. Mass.:
55968.24
Organism:
Homo sapiens (Human)
Description:
P36897
Residue:
503
  
Inhibitor
Name:
BDBM50148665
Synonyms:
4-(2-(6-isopropylpyridin-2-yl)-5,6-dihydro-4H-pyrrolo[1,2-b]pyrazol-3-yl)quinoline CHEMBL120245
Type:
Small organic molecule
Emp. Form.:
C23H22N4
Mol. Mass.:
354.4476
SMILES:
CC(C)c1cccc(n1)-c1nn2CCCc2c1-c1ccnc2ccccc12
: