Target
Neuropeptide Y receptor type 5
Ligand
BDBM50301192
Substrate
Meas. Tech.
ChEMBL_598776 (CHEMBL1042016)
IC50
>10000±n/a nM
Citation
 Kameda, MAndo, MNakama, CKobayashi, KKawamoto, HIto, SSuzuki, TTani, TOzaki, STokita, SSato, N Synthesis and evaluation of a series of 2,4-diaminopyridine derivatives as potential positron emission tomography tracers for neuropeptide Y Y1 receptors. Bioorg Med Chem Lett 19:5124-7 (2009)  
Target
Name:
Neuropeptide Y receptor type 5
Synonyms:
NPY-Y5 NPY5-R NPY5R_HUMAN NPYY5 Neuropeptide Y receptor type 5 ( NPY Y5) | Y5 receptor
Type:
Enzyme
Mol. Mass.:
50746.64
Organism:
Homo sapiens (Human)
Description:
Q15761
Residue:
445
  
Inhibitor
Name:
BDBM50301192
Synonyms:
6-((4-(fluoromethyl)-5-methylthiazol-2-ylthio)methyl)-N-((6-methylpyridin-2-yl)methyl)-4-morpholinopyridin-2-amine | CHEMBL585711
Type:
Small organic molecule
Emp. Form.:
C22H26FN5OS2
Mol. Mass.:
459.603
SMILES:
Cc1sc(SCc2cc(cc(NCc3cccc(C)n3)n2)N2CCOCC2)nc1CF
: