Target
Transthyretin
Ligand
BDBM50301375
Substrate
Meas. Tech.
ChEMBL_599726 (CHEMBL1048170)
IC50
10500±n/a nM
Citation
 González, AQuirante, JNieto, JAlmeida, MRSaraiva, MJPlanas, AArsequell, GValencia, G Isatin derivatives, a novel class of transthyretin fibrillogenesis inhibitors. Bioorg Med Chem Lett 19:5270-3 (2009)  
Target
Name:
Transthyretin
Synonyms:
ATTR Prealbumin TTHY_HUMAN Transthyretin (TTR)
Type:
Enzyme
Mol. Mass.:
15884.31
Organism:
Homo sapiens (Human)
Description:
P02766
Residue:
147
  
Inhibitor
Name:
BDBM50301375
Synonyms:
3,3',5,5'-tetraiodo-L-thyronine 4-(4-hydroxy-3,5-diiodophenoxy)-3,5-diiodo-L-phenylalanine L-T4 O-(4-hydroxy-3,5-diiodophenyl)-3,5-diiodo-L-tyrosine | levothyroxine
Type:
Small organic molecule
Emp. Form.:
C15H11I4NO4
Mol. Mass.:
776.87
SMILES:
N[C@@H](Cc1cc(I)c(Oc2cc(I)c(O)c(I)c2)c(I)c1)C(O)=O
: