Target
Tyrosine-protein kinase Lck
Ligand
BDBM50301603
Substrate
Meas. Tech.
ChEMBL_600521 (CHEMBL1049046)
IC50
0.06±n/a nM
Citation
 Hunt, JABeresis, RTGoulet, JLHolmes, MAHong, XJKovacs, EMills, SGRuzek, RDWong, FHermes, JDPark, YWSalowe, SPSonatore, LMWu, LWoods, AZaller, DMSinclair, PJ Disubstituted pyrimidines as Lck inhibitors. Bioorg Med Chem Lett 19:5440-3 (2009)  
Target
Name:
Tyrosine-protein kinase Lck
Synonyms:
2.7.10.2 LCK_HUMAN Leukocyte C-terminal Src kinase Lymphocyte-specific protein tyrosine kinase Protein YT16 Proto-oncogene tyrosine-protein kinase LCK T cell-specific protein-tyrosine kinase
Type:
Mol. Mass.:
57987.83
Organism:
Homo sapiens (Human)
Description:
P06239
Residue:
509
  
Inhibitor
Name:
BDBM50301603
Synonyms:
(S)-3-((S)-1-(4-(1H-benzo[d]imidazol-1-yl)pyrimidin-2-ylamino)ethyl)-4-methyl-N-(naphthalen-1-yl)piperazine-1-carboxamide | CHEMBL566813
Type:
Small organic molecule
Emp. Form.:
C29H30N8O
Mol. Mass.:
506.6015
SMILES:
C[C@H](Nc1nccc(n1)-n1cnc2ccccc12)[C@@H]1CN(CCN1C)C(=O)Nc1cccc2ccccc12
: