Target
Bile acid receptor
Ligand
BDBM50301755
Substrate
Meas. Tech.
ChEMBL_598064 (CHEMBL1049754)
EC50
5±n/a nM
Citation
 Mehlmann, JFCrawley, MLLundquist, JTUnwalla, RJHarnish, DCEvans, MJKim, CYWrobel, JEMahaney, PE Pyrrole[2,3-d]azepino compounds as agonists of the farnesoid X receptor (FXR). Bioorg Med Chem Lett 19:5289-92 (2009)  
Target
Name:
Bile acid receptor
Synonyms:
BAR FXR HRR1 NR1H4_HUMAN RIP14 Retinoid X receptor-interacting protein 14 | farnesoid x receptor
Type:
Nuclear Receptor
Mol. Mass.:
55916.24
Organism:
Homo sapiens (Human)
Description:
Q96RI1
Residue:
486
  
Inhibitor
Name:
BDBM50301755
Synonyms:
CHEMBL578150 | isopropyl 2-cyano-6-(4-fluorobenzoyl)-4,4-dimethyl-1,4,5,6-tetrahydropyrrolo[3,2-d]azepine-8-carboxylate
Type:
Small organic molecule
Emp. Form.:
C22H22FN3O3
Mol. Mass.:
395.4268
SMILES:
CC(C)OC(=O)C1=CN(CC(C)(C)c2cc([nH]c12)C#N)C(=O)c1ccc(F)cc1
: