Target
Metabotropic glutamate receptor 5
Ligand
BDBM50301821
Substrate
Meas. Tech.
ChEMBL_598102 (CHEMBL1038284)
IC50
1100±n/a nM
Citation
 Ito, SHirata, YNagatomi, YSatoh, ASuzuki, GKimura, TSatow, AMaehara, SHikichi, HHata, MOhta, HKawamoto, H Discovery and biological profile of isoindolinone derivatives as novel metabotropic glutamate receptor 1 antagonists: a potential treatment for psychotic disorders. Bioorg Med Chem Lett 19:5310-3 (2009)  
Target
Name:
Metabotropic glutamate receptor 5
Synonyms:
GPRC1E GRM5_HUMAN metabotropic glutamate 5 | metabotropic glutamate 5a
Type:
Enzyme
Mol. Mass.:
132484.72
Organism:
Homo sapiens (Human)
Description:
Residue:
1212
  
Inhibitor
Name:
BDBM50301821
Synonyms:
2-ethyl-5-(1-(2-fluoropyridin-3-yl)-5-methyl-1H-1,2,3-triazol-4-yl)isoindolin-1-one | CHEMBL577833
Type:
Small organic molecule
Emp. Form.:
C18H16FN5O
Mol. Mass.:
337.3509
SMILES:
CCN1Cc2cc(ccc2C1=O)-c1nnn(c1C)-c1cccnc1F
: