Target
Cytochrome P450 2D6
Ligand
BDBM50301835
Substrate
Meas. Tech.
ChEMBL_598209 (CHEMBL1047871)
IC50
>5000±n/a nM
Citation
 Martyn, DCBeletsky, GCortese, JFTyndall, ELiu, HFitzgerald, MMO'Shea, TJLiang, BClardy, J Synthesis and in vitro DMPK profiling of a 1,2-dioxolane-based library with activity against Plasmodium falciparum. Bioorg Med Chem Lett 19:5657-60 (2009)  
Target
Name:
Cytochrome P450 2D6
Synonyms:
CP2D6_HUMAN CYP2DL1 Cytochrome P450 2D6 (CYP2D6) P450-DB1
Type:
Protein
Mol. Mass.:
55774.82
Organism:
Homo sapiens (Human)
Description:
P10635
Residue:
497
  
Inhibitor
Name:
BDBM50301835
Synonyms:
CHEMBL572184 | N-(3-bromobenzyl)-2-(3-methyl-1,2-dioxaspiro[4.5]decan-3-yl)acetamide
Type:
Small organic molecule
Emp. Form.:
C18H24BrNO3
Mol. Mass.:
382.292
SMILES:
CC1(CC(=O)NCc2cccc(Br)c2)CC2(CCCCC2)OO1
: