Target
Dual specificity mitogen-activated protein kinase kinase 2
Ligand
BDBM50301966
Substrate
Meas. Tech.
ChEMBL_598693 (CHEMBL1050774)
Ki
16000±n/a nM
Citation
 Wood, MRSchirripa, KMKim, JJQuigley, AGStump, CABell, IMBednar, RAFay, JFBruno, JGMoore, ELMosser, SDRoller, SSalvatore, CAKane, SAVacca, JPSelnick, HG Novel CGRP receptor antagonists through a design strategy of target simplification with addition of molecular flexibility. Bioorg Med Chem Lett 19:5787-90 (2009)  
Target
Name:
Dual specificity mitogen-activated protein kinase kinase 2
Synonyms:
Dual specificity mitogen-activated protein kinase kinase 2 (MEK2) ERK activator kinase 2 MAP2K2 MAPKK 2 MKK2 PRKMK2 | VHL-MAP2K1/MAP2K2
Type:
Enzyme Catalytic Domain
Mol. Mass.:
44423.61
Organism:
Homo sapiens (Human)
Description:
gi_13489054
Residue:
400
  
Inhibitor
Name:
BDBM50301966
Synonyms:
CHEMBL568880 | N-(2-((S)-3-methyl-2,5-dioxo-1',3'-dihydrospiro[imidazolidine-4,2'-indene]-5'-ylamino)-2-oxoethyl)-N-((S)-1-phenylethyl)pivalamide
Type:
Small organic molecule
Emp. Form.:
C27H32N4O4
Mol. Mass.:
476.5674
SMILES:
C[C@H](N(CC(=O)Nc1ccc2C[C@@]3(Cc2c1)N(C)C(=O)NC3=O)C(=O)C(C)(C)C)c1ccccc1
: