Target
Calcitonin gene-related peptide type 1 receptor
Ligand
BDBM50301971
Substrate
Meas. Tech.
ChEMBL_598692 (CHEMBL1050773)
Ki
0.035±n/a nM
Citation
 Wood, MRSchirripa, KMKim, JJQuigley, AGStump, CABell, IMBednar, RAFay, JFBruno, JGMoore, ELMosser, SDRoller, SSalvatore, CAKane, SAVacca, JPSelnick, HG Novel CGRP receptor antagonists through a design strategy of target simplification with addition of molecular flexibility. Bioorg Med Chem Lett 19:5787-90 (2009)  
Target
Name:
Calcitonin gene-related peptide type 1 receptor
Synonyms:
Adrenomedullin receptor AM1; CALCRL/RAMP2 CALRL_HUMAN CGRP type 1 receptor mRNA Calcitonin gene-related peptide (CGRP) receptor Calcitonin receptor-like receptor Human CL receptor
Type:
Enzyme Catalytic Domain
Mol. Mass.:
52980.45
Organism:
Homo sapiens (Human)
Description:
Q16602
Residue:
461
  
Inhibitor
Name:
BDBM50301971
Synonyms:
2-((S)-6-(2,6-difluorophenyl)-3,3-dimethyl-2-oxopiperidin-1-yl)-N-((S)-2'-oxo-1,1',2',3-tetrahydrospiro[indene-2,3'-pyrrolo[2,3-b]pyridine]-5-yl)acetamide | CHEMBL585568
Type:
Small organic molecule
Emp. Form.:
C30H28F2N4O3
Mol. Mass.:
530.5651
SMILES:
CC1(C)CC[C@H](N(CC(=O)Nc2ccc3C[C@@]4(Cc3c2)C(=O)Nc2ncccc42)C1=O)c1c(F)cccc1F
: