Target
Tissue-type plasminogen activator
Ligand
BDBM50301976
Substrate
Meas. Tech.
ChEMBL_599100 (CHEMBL1047155)
IC50
15000±n/a nM
Citation
 West, CWAdler, MArnaiz, DChen, DChu, KGualtieri, GHo, EHuwe, CLight, DPhillips, GPulk, RSukovich, DWhitlow, MYuan, SBryant, J Identification of orally bioavailable, non-amidine inhibitors of Urokinase Plasminogen Activator (uPA). Bioorg Med Chem Lett 19:5712-5 (2009)  
Target
Name:
Tissue-type plasminogen activator
Synonyms:
Alteplase Reteplase Thrombin receptor protein Tissue-type plasminogen activator (tPA) t-PA t-plasminogen activator
Type:
Enzyme
Mol. Mass.:
62931.08
Organism:
Homo sapiens (Human)
Description:
Residue:
562
  
Inhibitor
Name:
BDBM50301976
Synonyms:
2-(6-(4-amino-3'-(aminomethyl)biphenyl-3-yloxy)-3,5-difluoropyridin-2-yloxy)-4-methylbenzoic acid | CHEMBL569809
Type:
Small organic molecule
Emp. Form.:
C26H21F2N3O4
Mol. Mass.:
477.4594
SMILES:
Cc1ccc(C(O)=O)c(Oc2nc(Oc3cc(ccc3N)-c3cccc(CN)c3)c(F)cc2F)c1
: