Target
Cannabinoid receptor 1
Ligand
BDBM50302371
Substrate
Meas. Tech.
ChEMBL_597135 (CHEMBL1048890)
EC50
10000±n/a nM
Citation
 Giblin, GMBillinton, ABriggs, MBrown, AJChessell, IPClayton, NMEatherton, AJGoldsmith, PHaslam, CJohnson, MRMitchell, WLNaylor, APerboni, ASlingsby, BPWilson, AW Discovery of 1-[4-(3-chlorophenylamino)-1-methyl-1H-pyrrolo[3,2-c]pyridin-7-yl]-1-morpholin-4-ylmethanone (GSK554418A), a brain penetrant 5-azaindole CB2 agonist for the treatment of chronic pain. J Med Chem 52:5785-8 (2009)  
Target
Name:
Cannabinoid receptor 1
Synonyms:
CANN6 CB-R CNR CNR1_HUMAN Cannabinoid receptor Cannabinoid receptor 1 (brain)
Type:
G Protein-Coupled Receptor (GPCR)
Mol. Mass.:
52868.96
Organism:
Homo sapiens (Human)
Description:
P21554
Residue:
472
  
Inhibitor
Name:
BDBM50302371
Synonyms:
1-[7-(3-Chloro-phenylamino)-3-methyl-1H-pyrrolo[2,3-c]pyridin-4-yl]-1-morpholin-4-yl-methanone | CHEMBL567911
Type:
Small organic molecule
Emp. Form.:
C19H19ClN4O2
Mol. Mass.:
370.833
SMILES:
Cc1c[nH]c2c(Nc3cccc(Cl)c3)ncc(C(=O)N3CCOCC3)c12
: