Target
Bifunctional epoxide hydrolase 2
Ligand
BDBM50302465
Substrate
Meas. Tech.
ChEMBL_597622 (CHEMBL1039074)
IC50
19±n/a nM
Citation
 Taylor, SJSoleymanzadeh, FEldrup, ABFarrow, NAMuegge, IKukulka, AKabcenell, AKDe Lombaert, S Design and synthesis of substituted nicotinamides as inhibitors of soluble epoxide hydrolase. Bioorg Med Chem Lett 19:5864-8 (2009)  
Target
Name:
Bifunctional epoxide hydrolase 2
Synonyms:
Ephx2 HYES_RAT
Type:
PROTEIN
Mol. Mass.:
62337.15
Organism:
Rattus norvegicus
Description:
ChEMBL_1465995
Residue:
554
  
Inhibitor
Name:
BDBM50302465
Synonyms:
CHEMBL566048 | N-(2-chloro-4-(N-methylsulfamoyl)benzyl)-6-(3,3,3-trifluoropropoxy)nicotinamide
Type:
Small organic molecule
Emp. Form.:
C17H17ClF3N3O4S
Mol. Mass.:
451.848
SMILES:
CNS(=O)(=O)c1ccc(CNC(=O)c2ccc(OCCC(F)(F)F)nc2)c(Cl)c1
: