Target
Melanin-concentrating hormone receptor 1
Ligand
BDBM50302559
Substrate
Meas. Tech.
ChEMBL_594562 (CHEMBL1037057)
IC50
2±n/a nM
Citation
 Semple, GTran, TAKramer, BHsu, DHan, SChoi, JVallar, PCasper, MDZou, NHauser, EKThomsen, WWhelan, KSengupta, DMorgan, MSekiguchi, YKanuma, KChaki, SGrottick, AJ Pyrimidine-based antagonists of h-MCH-R1 derived from ATC0175: in vitro profiling and in vivo evaluation. Bioorg Med Chem Lett 19:6166-71 (2009)  
Target
Name:
Melanin-concentrating hormone receptor 1
Synonyms:
G-protein coupled receptor 24 MCH receptor 1 MCH-R1 MCHR-1 MCHR1_HUMAN Melanin-Concentrating Hormone Receptor 1 (MCH1R) Melanin-concentrating hormone receptor 1 (MCH-1) Melanin-concentrating hormone receptor 1 (MCHR-1) SLC-1 Somatostatin receptor-like protein
Type:
G Protein-Coupled Receptor (GPCR)
Mol. Mass.:
45976.27
Organism:
Homo sapiens (Human)
Description:
Membranes from CHO-K1 cells stably expressing human MCH1R were used in assays.
Residue:
422
  
Inhibitor
Name:
BDBM50302559
Synonyms:
CHEMBL578049 | N-(cis-4-{[4-(Dimethylamino)-5-methylpyrimidin-2-yl]amino}-cyclohexyl)-3,4-difluorobenzamide
Type:
Small organic molecule
Emp. Form.:
C20H25F2N5O
Mol. Mass.:
389.4422
SMILES:
CN(C)c1nc(N[C@@H]2CC[C@@H](CC2)NC(=O)c2ccc(F)c(F)c2)ncc1C
: