Target
5-hydroxytryptamine receptor 2B
Ligand
BDBM50170191
Substrate
Meas. Tech.
ChEMBL_594564 (CHEMBL1037059)
IC50
9.66±n/a nM
Citation
 Semple, GTran, TAKramer, BHsu, DHan, SChoi, JVallar, PCasper, MDZou, NHauser, EKThomsen, WWhelan, KSengupta, DMorgan, MSekiguchi, YKanuma, KChaki, SGrottick, AJ Pyrimidine-based antagonists of h-MCH-R1 derived from ATC0175: in vitro profiling and in vivo evaluation. Bioorg Med Chem Lett 19:6166-71 (2009)  
Target
Name:
5-hydroxytryptamine receptor 2B
Synonyms:
5-HT-2B 5-hydroxytryptamine (serotonin) receptor 2B [Homo sapiens] 5-hydroxytryptamine receptor 2C (5HT2C) HTR2B Serotonin 2b (5-HT2b) receptor | Serotonin Receptor 2B
Type:
G Protein-Coupled Receptor (GPCR)
Mol. Mass.:
54312.47
Organism:
Homo sapiens (Human)
Description:
Receptor binding assays were performed using human clone stably expressed in CHO cells.
Residue:
481
  
Inhibitor
Name:
BDBM50170191
Synonyms:
CHEMBL182150 N-[4-(4-Dimethylamino-quinazolin-2-ylamino)-cyclohexyl]-3,4-difluoro-benzamide
Type:
Small organic molecule
Emp. Form.:
C23H25F2N5O
Mol. Mass.:
425.4743
SMILES:
CN(C)c1nc(N[C@@H]2CC[C@@H](CC2)NC(=O)c2ccc(F)c(F)c2)nc2ccccc12
: